BDBM50383901 CHEMBL2031455
SMILES COC(=O)c1ccc(OCc2ccc3ccccc3n2)cc1C1(CC(C)(C)C1)c1ccccc1
InChI Key InChIKey=IOYFPEKFAQUWHT-UHFFFAOYSA-N
Data  2 IC50
  Tab Delimited (TSV)   2D SDfile   Computed 3D by Vconf -m prep SDfile
Find this compound or compounds like it in BindingDB:
Activity Spreadsheet -- Enzyme Inhibition Constant Data from BindingDB
Found 2 hits for monomerid = 50383901
TargetArachidonate 5-lipoxygenase-activating protein(Homo sapiens (Human))
Merck Research Laboratories
Curated by ChEMBL
LigandPNGBDBM50383901(CHEMBL2031455)
Affinity DataIC50:  1.40E+3nM. Assay description: Inhibition of 5-lipoxygenase-activating protein in human polymorphonuclear cells assessed as inhibition of calcium ionophore-induced LTB4 production ...
In DepthDetails ArticlePubMed
TargetArachidonate 5-lipoxygenase-activating protein(Homo sapiens (Human))
Merck Research Laboratories
Curated by ChEMBL
LigandPNGBDBM50383901(CHEMBL2031455)
Affinity DataIC50:  5.20nM. Assay description: Displacement of [125I]L-691,831 from 5-lipoxygenase-activating protein in human polymorphonuclear cells
In DepthDetails ArticlePubMed