BDBM50384112 CHEMBL2029557
SMILES Cc1ccc(cc1)S(=O)(=O)N1C(=O)OC(C)(C)C1=O
InChI Key InChIKey=FXXBETJZKKPYFW-UHFFFAOYSA-N
Data  3 IC50
  Tab Delimited (TSV)   2D SDfile   Computed 3D by Vconf -m prep SDfile
Find this compound or compounds like it in BindingDB:
Activity Spreadsheet -- Enzyme Inhibition Constant Data from BindingDB
Found 3 hits for monomerid = 50384112
TargetNeutrophil elastase(Homo sapiens (Human))
University Of Lisbon
Curated by ChEMBL
LigandPNGBDBM50384112(CHEMBL2029557)
Affinity DataIC50:  2.60E+3nM. Assay description: Inhibition of human neutrophil elastase using chromogenic substrate (N-MeOSuc-Ala-Ala-Pro-Val-p-nitroanilide after 120 mins
In DepthDetails ArticlePubMed
TargetMyeloblastin(Homo sapiens (Human))
University Of Lisbon
Curated by ChEMBL
LigandPNGBDBM50384112(CHEMBL2029557)
Affinity DataIC50:  1.45E+4nM. Assay description: Inhibition of proteinase 3 using N-MeOSuc-Ala-Ala-Pro-Val-p-nitroanilide as substrate after 60 mins
In DepthDetails ArticlePubMed
TargetCathepsin G(Homo sapiens (Human))
University Of Lisbon
Curated by ChEMBL
LigandPNGBDBM50384112(CHEMBL2029557)
Affinity DataIC50:  3.69E+5nM. Assay description: Inhibition of cathepsin G using Suc-Ala-Ala-Pro-Phe-p-nitroanilide as substrate after 30 mins
In DepthDetails ArticlePubMed