BDBM50386583 CHEMBL2046462
SMILES Clc1cncc(Cl)c1NNC(=O)Cc1ccccc1
InChI Key InChIKey=QNZYKKYBDZYJNS-UHFFFAOYSA-N
Data  1 IC50
  Tab Delimited (TSV)   2D SDfile   Computed 3D by Vconf -m prep SDfile
Find this compound or compounds like it in BindingDB:
Activity Spreadsheet -- Enzyme Inhibition Constant Data from BindingDB
Found 1 hit for monomerid = 50386583
TargetP2X purinoceptor 7(Homo sapiens (Human))
Gwangju Institute Of Science And Technology (Gist)
Curated by ChEMBL
LigandPNGBDBM50386583(CHEMBL2046462)
Affinity DataIC50:  1.10E+3nM. Assay description: Antagonist activity at human P2X7 receptor expressed in HEK293 cells assessed as inhibition of BzATP-induced ethidium bromide uptake after 2 hrs by f...
In DepthDetails ArticlePubMed