BDBM50386588 CHEMBL2048262
SMILES Clc1ccc(CCC(=O)NNc2c(Cl)cncc2Cl)cc1
InChI Key InChIKey=OYRKPMKXFAGLSA-UHFFFAOYSA-N
Data  1 IC50
  Tab Delimited (TSV)   2D SDfile   Computed 3D by Vconf -m prep SDfile
Find this compound or compounds like it in BindingDB:
Activity Spreadsheet -- Enzyme Inhibition Constant Data from BindingDB
Found 1 hit for monomerid = 50386588
TargetP2X purinoceptor 7(Homo sapiens (Human))
Gwangju Institute Of Science And Technology (Gist)
Curated by ChEMBL
LigandPNGBDBM50386588(CHEMBL2048262)
Affinity DataIC50:  1.10E+3nM. Assay description: Antagonist activity at human P2X7 receptor expressed in HEK293 cells assessed as inhibition of BzATP-induced ethidium bromide uptake after 2 hrs by f...
In DepthDetails ArticlePubMed