BDBM50386777 CHEMBL2046918
SMILES CNc1nc2nc(-c3ccc(cc3)C(F)(F)P(O)(O)=O)n(CCOc3ccc(Cl)cc3)c2c(=O)[nH]1
InChI Key InChIKey=ZIPYKPGMJNDUSX-UHFFFAOYSA-N
Data  1 IC50
  Tab Delimited (TSV)   2D SDfile   Computed 3D by Vconf -m prep SDfile
Find this compound or compounds like it in BindingDB:
Activity Spreadsheet -- Enzyme Inhibition Constant Data from BindingDB
Found 1 hit for monomerid = 50386777
TargetEukaryotic translation initiation factor 4E(Homo sapiens (Human))
Amgen
Curated by ChEMBL
LigandPNGBDBM50386777(CHEMBL2046918)
Affinity DataIC50:  16nM. Assay description: Competitive inhibition of [3H]m7-GTP binding to human FLAG-His6 tagged eIF4E expressed in Escherichia coli by scintillation proximity assay
In DepthDetails ArticlePubMed