BDBM50386905 CHEMBL2048519
SMILES CN(CCF)C[C@@H]1[C@H]2CC[C@@H](C[C@@H]1c1ccc(Cl)cc1)N2C
InChI Key InChIKey=UWGODAMEDSNNHJ-XWTMOSNGSA-N
Data  1 KI
  Tab Delimited (TSV)   2D SDfile   Computed 3D by Vconf -m prep SDfile
Find this compound or compounds like it in BindingDB:
Activity Spreadsheet -- Enzyme Inhibition Constant Data from BindingDB
Found 1 hit for monomerid = 50386905
TargetSodium-dependent dopamine transporter(Homo sapiens (Human))
Beijing Normal University
Curated by ChEMBL
LigandPNGBDBM50386905(CHEMBL2048519)
Affinity DataKi:  3.79nM. Assay description: Displacement of [125I]IPT from DAT overexpressed in LLC-PK1 cell membrane by competitive binding assay
In DepthDetails ArticlePubMed