BDBM50386907 CHEMBL2048521
SMILES CN(CCOCCF)C[C@@H]1[C@H]2CC[C@@H](C[C@@H]1c1ccc(Cl)cc1)N2C
InChI Key InChIKey=KBXQOGFSLYHIJB-ZGXWSNOMSA-N
Data  1 KI
  Tab Delimited (TSV)   2D SDfile   Computed 3D by Vconf -m prep SDfile
Find this compound or compounds like it in BindingDB:
Activity Spreadsheet -- Enzyme Inhibition Constant Data from BindingDB
Found 1 hit for monomerid = 50386907
TargetSodium-dependent dopamine transporter(Homo sapiens (Human))
Beijing Normal University
Curated by ChEMBL
LigandPNGBDBM50386907(CHEMBL2048521)
Affinity DataKi:  4.63nM. Assay description: Displacement of [125I]IPT from DAT overexpressed in LLC-PK1 cell membrane by competitive binding assay
In DepthDetails ArticlePubMed