BDBM50387184 CHEMBL2048187
SMILES COc1ccc(cc1CSc1nc2cc(F)ccc2n1CC(O)=O)C(C)=O
InChI Key InChIKey=YMSMSUFAXNUPLK-UHFFFAOYSA-N
Data  10 IC50
  Tab Delimited (TSV)   2D SDfile   Computed 3D by Vconf -m prep SDfile
Find this compound or compounds like it in BindingDB:
Activity Spreadsheet -- Enzyme Inhibition Constant Data from BindingDB
Found 10 hits for monomerid = 50387184
TargetThromboxane A2 receptor(Homo sapiens (Human))
Actelion Pharmaceuticals
Curated by ChEMBL
LigandPNGBDBM50387184(CHEMBL2048187)
Affinity DataIC50: >2.50E+4nM. Assay description: Antagonist activity at human TP receptor by FLIPR assay
In DepthDetails ArticlePubMed
TargetCytochrome P450 2D6(Homo sapiens (Human))
Actelion Pharmaceuticals
Curated by ChEMBL
LigandPNGBDBM50387184(CHEMBL2048187)
Affinity DataIC50: >5.00E+4nM. Assay description: Inhibition of CYP2D6
In DepthDetails ArticlePubMed
TargetCytochrome P450 3A4(Homo sapiens (Human))
Actelion Pharmaceuticals
Curated by ChEMBL
LigandPNGBDBM50387184(CHEMBL2048187)
Affinity DataIC50:  1.00E+4nM. Assay description: Inhibition of CYP3A4 using midazolam as substrate
In DepthDetails ArticlePubMed
TargetCytochrome P450 3A4(Homo sapiens (Human))
Actelion Pharmaceuticals
Curated by ChEMBL
LigandPNGBDBM50387184(CHEMBL2048187)
Affinity DataIC50:  1.50E+4nM. Assay description: Inhibition of CYP3A4 using testosterone as substrate
In DepthDetails ArticlePubMed
TargetProstaglandin D2 receptor 2(Homo sapiens (Human))
Actelion Pharmaceuticals
Curated by ChEMBL
LigandPNGBDBM50387184(CHEMBL2048187)
Affinity DataIC50:  2nM. Assay description: Displacement of [3H]-PGD2 from human CRTh2 receptor expressed in HEK293 cells
In DepthDetails ArticlePubMed
TargetProstaglandin D2 receptor(Homo sapiens (Human))
Actelion Pharmaceuticals
Curated by ChEMBL
LigandPNGBDBM50387184(CHEMBL2048187)
Affinity DataIC50: >1.00E+4nM. Assay description: Displacement of [3H]-PGD2 from human DP1 receptor expressed in CHO cells
In DepthDetails ArticlePubMed
TargetProstaglandin D2 receptor 2(Homo sapiens (Human))
Actelion Pharmaceuticals
Curated by ChEMBL
LigandPNGBDBM50387184(CHEMBL2048187)
Affinity DataIC50:  5nM. Assay description: Antagonist activity at human CRTh2 receptor in human whole blood assessed as inhibition of PGD2-induced eosinophil shape change after 10 mins by flow...
In DepthDetails ArticlePubMed
TargetProstaglandin D2 receptor 2(Homo sapiens (Human))
Actelion Pharmaceuticals
Curated by ChEMBL
LigandPNGBDBM50387184(CHEMBL2048187)
Affinity DataIC50:  14nM. Assay description: Displacement of [3H]-PGD2 from human CRTh2 receptor expressed in HEK293 cells in presence of 0.5% human serum albumin
In DepthDetails ArticlePubMed
TargetProstaglandin D2 receptor 2(Homo sapiens (Human))
Actelion Pharmaceuticals
Curated by ChEMBL
LigandPNGBDBM50387184(CHEMBL2048187)
Affinity DataIC50:  5nM. Assay description: Antagonist activity at human CRTh2 receptor expressed in HEK293 cells assessed as inhibition of PGD2-induced calcium flux by FLIPR assay
In DepthDetails ArticlePubMed
TargetCytochrome P450 2C9(Homo sapiens (Human))
Actelion Pharmaceuticals
Curated by ChEMBL
LigandPNGBDBM50387184(CHEMBL2048187)
Affinity DataIC50: >5.00E+4nM. Assay description: Inhibition of CYP2C9
In DepthDetails ArticlePubMed