BDBM50387191 CHEMBL2048196
SMILES CCCCOc1ccc(cc1CSc1nc2cc(F)ccc2n1CC(O)=O)C(C)=O
InChI Key InChIKey=VARJKIVVSDZDKA-UHFFFAOYSA-N
Data  2 IC50
  Tab Delimited (TSV)   2D SDfile   Computed 3D by Vconf -m prep SDfile
Find this compound or compounds like it in BindingDB:
Activity Spreadsheet -- Enzyme Inhibition Constant Data from BindingDB
Found 2 hits for monomerid = 50387191
TargetProstaglandin D2 receptor 2(Homo sapiens (Human))
Actelion Pharmaceuticals
Curated by ChEMBL
LigandPNGBDBM50387191(CHEMBL2048196)
Affinity DataIC50:  12nM. Assay description: Antagonist activity at human CRTh2 receptor expressed in HEK293 cells assessed as inhibition of PGD2-induced calcium flux by FLIPR assay
In DepthDetails ArticlePubMed
TargetProstaglandin D2 receptor 2(Homo sapiens (Human))
Actelion Pharmaceuticals
Curated by ChEMBL
LigandPNGBDBM50387191(CHEMBL2048196)
Affinity DataIC50:  9nM. Assay description: Displacement of [3H]-PGD2 from human CRTh2 receptor expressed in HEK293 cells
In DepthDetails ArticlePubMed