BDBM50387671 CHEMBL2058084
SMILES CCn1c(CNc2ccccc2)nnc1SCC(=O)Nc1ccccc1
InChI Key InChIKey=MZULLCBKLHDMEM-UHFFFAOYSA-N
Data  2 IC50
  Tab Delimited (TSV)   2D SDfile   Computed 3D by Vconf -m prep SDfile
Find this compound or compounds like it in BindingDB:
Activity Spreadsheet -- Enzyme Inhibition Constant Data from BindingDB
Found 2 hits for monomerid = 50387671
TargetLong-chain fatty acid transport protein 1(Mus musculus)
Daiichi Sankyo
Curated by ChEMBL
LigandPNGBDBM50387671(CHEMBL2058084)
Affinity DataIC50: >1.00E+4nM. Assay description: Inhibition of mouse recombinant FATP1 acyl-coA synthetase activity using [14C]oleic acid as substrate
In DepthDetails ArticlePubMed
TargetLong-chain fatty acid transport protein 1(Homo sapiens (Human))
Daiichi Sankyo
Curated by ChEMBL
LigandPNGBDBM50387671(CHEMBL2058084)
Affinity DataIC50: >1.00E+3nM. Assay description: Inhibition of human recombinant FATP1 acyl-coA synthetase activity using [14C]oleic acid as substrate
In DepthDetails ArticlePubMed