BDBM50388093 CHEMBL2059197
SMILES CCCNC(=O)c1cc2c(c(cnc2[nH]1)-c1cncc(c1)C(O)=O)-n1ccc(n1)C(F)(F)F
InChI Key InChIKey=LZUVYNLKKXOOOT-UHFFFAOYSA-N
Data  1 IC50
  Tab Delimited (TSV)   2D SDfile   Computed 3D by Vconf -m prep SDfile
Find this compound or compounds like it in BindingDB:
Activity Spreadsheet -- Enzyme Inhibition Constant Data from BindingDB
Found 1 hit for monomerid = 50388093
TargetDNA gyrase subunit B(Staphylococcus aureus)
Astrazeneca
Curated by ChEMBL
LigandPNGBDBM50388093(CHEMBL2059197)
Affinity DataIC50:  58nM. Assay description: Inhibition of Staphylococcus aureus DNA gyrase B expressed in Escherichia coli BL21(DE3) cells assessed ATP hydrolysis activity after 18 to 24 hrs by...
In DepthDetails ArticlePubMed