BDBM50388352 CHEMBL2057272
SMILES COc1cccc(C2OC(CC(=O)N3CCC(CC(O)=O)CC3)c3cccn3-c3ccc(Cl)cc23)c1OC
InChI Key InChIKey=MSSQOQPKGAMUSY-UHFFFAOYSA-N
Data  1 IC50
PDB links: 1 PDB ID matches this monomer.
  Tab Delimited (TSV)   2D SDfile   Computed 3D by Vconf -m prep SDfile
Find this compound or compounds like it in BindingDB:
Activity Spreadsheet -- Enzyme Inhibition Constant Data from BindingDB
Found 1 hit for monomerid = 50388352
TargetSqualene synthase(Rattus norvegicus)
Daiichi Sankyo
Curated by ChEMBL
LigandPNGBDBM50388352(CHEMBL2057272)
Affinity DataIC50:  2.70nM. Assay description: Inhibition of squalene synthase in rat hepatic cells