BDBM50388367 CHEMBL2057628
SMILES COc1cccc([C@H]2O[C@H](CCC(=O)N3CCC[C@@H](C3)C(O)=O)c3cccn3-c3ccc(Cl)cc23)c1OC
InChI Key InChIKey=DWIAZOHRCFODIE-WCTKDPGZSA-N
Data  1 IC50
  Tab Delimited (TSV)   2D SDfile   Computed 3D by Vconf -m prep SDfile
Find this compound or compounds like it in BindingDB:
Activity Spreadsheet -- Enzyme Inhibition Constant Data from BindingDB
Found 1 hit for monomerid = 50388367
TargetSqualene synthase(Rattus norvegicus)
Daiichi Sankyo
Curated by ChEMBL
LigandPNGBDBM50388367(CHEMBL2057628)
Affinity DataIC50:  1.40nM. Assay description: Inhibition of squalene synthase in rat hepatic cells
In DepthDetails ArticlePubMed