BDBM50388373 CHEMBL2057634
SMILES COc1cccc([C@H]2O[C@H](CCC(=O)N3CCOC(C3)C(O)=O)c3cccn3-c3ccc(Cl)cc23)c1OC
InChI Key InChIKey=NCODWICGCMYWRL-RUNFXNGRSA-N
Data  1 IC50
  Tab Delimited (TSV)   2D SDfile   Computed 3D by Vconf -m prep SDfile
Find this compound or compounds like it in BindingDB:
Activity Spreadsheet -- Enzyme Inhibition Constant Data from BindingDB
Found 1 hit for monomerid = 50388373
TargetSqualene synthase(Rattus norvegicus)
Daiichi Sankyo
Curated by ChEMBL
LigandPNGBDBM50388373(CHEMBL2057634)
Affinity DataIC50:  1.60nM. Assay description: Inhibition of squalene synthase in rat hepatic cells
In DepthDetails ArticlePubMed