BDBM50388542 CHEMBL2059074
SMILES Nc1ccc(cc1S(=O)(=O)c1cc(ccc1N)C(O)=O)C(O)=O
InChI Key InChIKey=RWIMXESREAVUOA-UHFFFAOYSA-N
Data  1 IC50
  Tab Delimited (TSV)   2D SDfile   Computed 3D by Vconf -m prep SDfile
Find this compound or compounds like it in BindingDB:
Activity Spreadsheet -- Enzyme Inhibition Constant Data from BindingDB
Found 1 hit for monomerid = 50388542
TargetM-phase inducer phosphatase 2(Homo sapiens (Human))
Universit£
Curated by ChEMBL
LigandPNGBDBM50388542(CHEMBL2059074)
Affinity DataIC50:  2.01E+4nM. Assay description: Inhibition of recombinant phosphatase activity of Cdc25B catalytic domain expressed in Escherichia coli BL21(DE3) using OMFP as substrate by spectrof...
In DepthDetails ArticlePubMed