BDBM50388985 CHEMBL2063885
SMILES CN(C)CC[C@H](CSc1ccccc1)Nc1ccc(cc1[N+]([O-])=O)S(=O)(=O)NC(=O)c1ccc(cc1)C#Cc1cccc(c1)-c1c(cn(CC[C@H](O)CO)c1C(=O)NCCCN1CCN(C)CC1)-c1ccc(Cl)cc1
InChI Key InChIKey=LEDIEZNRMKDWOE-ZYIRWWKFSA-N
Data  3 IC50
  Tab Delimited (TSV)   2D SDfile   Computed 3D by Vconf -m prep SDfile
Find this compound or compounds like it in BindingDB:
Activity Spreadsheet -- Enzyme Inhibition Constant Data from BindingDB
Found 3 hits for monomerid = 50388985
TargetInduced myeloid leukemia cell differentiation protein Mcl-1(Homo sapiens (Human))
University Of Michigan
Curated by ChEMBL
LigandPNGBDBM50388985(CHEMBL2063885)
Affinity DataIC50: >1.00E+4nM. Assay description: Binding affinity to N-terminus 8X His-tagged human Mcl1 expressed in Escherichia coli BL21 (DE3) cells after 2 hrs by fluorescence polarization assay
In DepthDetails ArticlePubMed
TargetBcl-2-like protein 1(Homo sapiens (Human))
University Of Michigan
Curated by ChEMBL
LigandPNGBDBM50388985(CHEMBL2063885)
Affinity DataIC50:  5.70nM. Assay description: Binding affinity to N-terminus 8X His-tagged human Bcl-xL expressed in Escherichia coli BL21 (DE3) cells after 2 hrs by fluorescence polarization ass...
In DepthDetails ArticlePubMed
TargetApoptosis regulator Bcl-2(Homo sapiens (Human))
University Of Michigan
Curated by ChEMBL
LigandPNGBDBM50388985(CHEMBL2063885)
Affinity DataIC50:  1.90nM. Assay description: Binding affinity to N-terminus 6X His-tagged human Bcl2 expressed in Escherichia coli BL21 (DE3) cells after 2 hrs by fluorescence polarization assay
In DepthDetails ArticlePubMed