BDBM50389790 CHEMBL2070382
SMILES C1CN2CCNCc3cc(CNCCN(CCNCc4cc(CN1)n[nH]4)CCNCc1cc(CNCC2)n[nH]1)[nH]n3
InChI Key InChIKey=KSIGFNANQYWQCU-UHFFFAOYSA-N
Data  1 IC50
  Tab Delimited (TSV)   2D SDfile   Computed 3D by Vconf -m prep SDfile
Find this compound or compounds like it in BindingDB:
Activity Spreadsheet -- Enzyme Inhibition Constant Data from BindingDB
Found 1 hit for monomerid = 50389790
TargetExtracellular superoxide dismutase [Cu-Zn](Homo sapiens (Human))
Universidad De Granada
Curated by ChEMBL
LigandPNGBDBM50389790(CHEMBL2070382)
Affinity DataIC50:  2.74E+5nM. Assay description: Inhibition of human erythrocyte Cu-Zn SOD by NBT reduction assay
In DepthDetails ArticlePubMed