BDBM50389792 CHEMBL2070384
SMILES C(c1ccccc1)n1nc2CNCCNCCNCc3cc(CNCCNCCNCc1c2)nn3Cc1ccccc1
InChI Key InChIKey=CSXJEYXZBSEEOY-UHFFFAOYSA-N
Data  1 IC50
  Tab Delimited (TSV)   2D SDfile   Computed 3D by Vconf -m prep SDfile
Find this compound or compounds like it in BindingDB:
Activity Spreadsheet -- Enzyme Inhibition Constant Data from BindingDB
Found 1 hit for monomerid = 50389792
TargetExtracellular superoxide dismutase [Cu-Zn](Homo sapiens (Human))
Universidad De Granada
Curated by ChEMBL
LigandPNGBDBM50389792(CHEMBL2070384)
Affinity DataIC50:  1.55E+5nM. Assay description: Inhibition of human erythrocyte Cu-Zn SOD by NBT reduction assay
In DepthDetails ArticlePubMed