BDBM50389793 CHEMBL2070385
SMILES CCCCCCCCN1CCNCc2cc(CNCCN(CCCCCCCC)CCNCc3cc(CNCC1)n[nH]3)[nH]n2
InChI Key InChIKey=QYZIRYJVBKAYJE-UHFFFAOYSA-N
Data  1 IC50
  Tab Delimited (TSV)   2D SDfile   Computed 3D by Vconf -m prep SDfile
Find this compound or compounds like it in BindingDB:
Activity Spreadsheet -- Enzyme Inhibition Constant Data from BindingDB
Found 1 hit for monomerid = 50389793
TargetExtracellular superoxide dismutase [Cu-Zn](Homo sapiens (Human))
Universidad De Granada
Curated by ChEMBL
LigandPNGBDBM50389793(CHEMBL2070385)
Affinity DataIC50:  8.92E+4nM. Assay description: Inhibition of human erythrocyte Cu-Zn SOD by NBT reduction assay
In DepthDetails ArticlePubMed