BDBM50390045 CHEMBL2071583
SMILES Fc1ccc(cc1)N1CC(CC1=O)c1nc(no1)-c1cccc(c1)C(F)(F)F
InChI Key InChIKey=FWDLSFOLXLYANW-UHFFFAOYSA-N
Data  1 EC50
  Tab Delimited (TSV)   2D SDfile   Computed 3D by Vconf -m prep SDfile
Find this compound or compounds like it in BindingDB:
Activity Spreadsheet -- Enzyme Inhibition Constant Data from BindingDB
Found 1 hit for monomerid = 50390045
TargetMetabotropic glutamate receptor 5(Homo sapiens (Human))
Lundbeck Research Usa
Curated by ChEMBL
LigandPNGBDBM50390045(CHEMBL2071583)
Affinity DataEC50: >1.00E+4nM. Assay description: Positive allosteric modulation of human mGluR5 expressed in HEK293A cells assessed as stimulation of glutamate-induced calcium flux by FLIPR method
In DepthDetails ArticlePubMed