BDBM50390065 CHEMBL2069395
SMILES Clc1cccc(c1)-c1noc(CCN2C(=O)COc3ccccc23)n1
InChI Key InChIKey=BAZUDQMMSJLVLJ-UHFFFAOYSA-N
Data  1 IC50  1 EC50
  Tab Delimited (TSV)   2D SDfile   Computed 3D by Vconf -m prep SDfile
Find this compound or compounds like it in BindingDB:
Activity Spreadsheet -- Enzyme Inhibition Constant Data from BindingDB
Found 2 hits for monomerid = 50390065
TargetMetabotropic glutamate receptor 5(Homo sapiens (Human))
Lundbeck Research Usa
Curated by ChEMBL
LigandPNGBDBM50390065(CHEMBL2069395)
Affinity DataIC50:  800nM. Assay description: Negative allosteric modulation of human mGluR5 expressed in HEK293A cells assessed as inhibition of glutamate-induced calcium flux by FLIPR method
In DepthDetails ArticlePubMed
TargetMetabotropic glutamate receptor 5(Homo sapiens (Human))
Lundbeck Research Usa
Curated by ChEMBL
LigandPNGBDBM50390065(CHEMBL2069395)
Affinity DataEC50: >1.00E+4nM. Assay description: Positive allosteric modulation of human mGluR5 expressed in HEK293A cells assessed as stimulation of glutamate-induced calcium flux by FLIPR method
In DepthDetails ArticlePubMed