BDBM50390067 CHEMBL2069387
SMILES Fc1ccc(CN2CC(CC2=O)c2nc(no2)-c2cccc(Cl)c2)cc1
InChI Key InChIKey=ZWBNOSOSWCVZAA-UHFFFAOYSA-N
Data  1 IC50
  Tab Delimited (TSV)   2D SDfile   Computed 3D by Vconf -m prep SDfile
Find this compound or compounds like it in BindingDB:
Activity Spreadsheet -- Enzyme Inhibition Constant Data from BindingDB
Found 1 hit for monomerid = 50390067
TargetMetabotropic glutamate receptor 5(Homo sapiens (Human))
Lundbeck Research Usa
Curated by ChEMBL
LigandPNGBDBM50390067(CHEMBL2069387)
Affinity DataIC50:  3.60E+3nM. Assay description: Negative allosteric modulation of human mGluR5 expressed in HEK293A cells assessed as inhibition of glutamate-induced calcium flux by FLIPR method
In DepthDetails ArticlePubMed