BDBM50390299 CHEMBL2070761
SMILES CN(C)CCCNc1nc(nc2n(C[C@H]3CCCO3)nnc12)C(F)(F)F
InChI Key InChIKey=RJOMWCOKCJHNMX-SNVBAGLBSA-N
Data  1 IC50
  Tab Delimited (TSV)   2D SDfile   Computed 3D by Vconf -m prep SDfile
Find this compound or compounds like it in BindingDB:
Activity Spreadsheet -- Enzyme Inhibition Constant Data from BindingDB
Found 1 hit for monomerid = 50390299
LigandPNGBDBM50390299(CHEMBL2070761)
Affinity DataIC50: >1.00E+4nM. Assay description: Inhibition of PDE8B expressed in Sf9 insect cells
In DepthDetails ArticlePubMed