BDBM50390555 CHEMBL2069344
SMILES Cc1ccnc(Nc2cccc(n2)-c2ccnc(c2)N2CCCNCC2)c1
InChI Key InChIKey=GCEBXPHKCREIQL-UHFFFAOYSA-N
Data  1 IC50
  Tab Delimited (TSV)   2D SDfile   Computed 3D by Vconf -m prep SDfile
Find this compound or compounds like it in BindingDB:
Activity Spreadsheet -- Enzyme Inhibition Constant Data from BindingDB
Found 1 hit for monomerid = 50390555
TargetLysine--tRNA ligase(Homo sapiens (Human))
RhôNe-Poulenc Rorer
Curated by ChEMBL
LigandPNGBDBM50390555(CHEMBL2069344)
Affinity DataIC50:  27nM. Assay description: Inhibition of human recombinant full-length Syk using poly-GT as substrate after 40 mins by radioactive filtration assay
In DepthDetails ArticlePubMed