BDBM50390572 CHEMBL2069361
SMILES Cc1ccnc(Nc2cccc(n2)-c2cccnc2)c1
InChI Key InChIKey=AAXCNJIPLAHVFJ-UHFFFAOYSA-N
Data  1 IC50
  Tab Delimited (TSV)   2D SDfile   Computed 3D by Vconf -m prep SDfile
Find this compound or compounds like it in BindingDB:
Activity Spreadsheet -- Enzyme Inhibition Constant Data from BindingDB
Found 1 hit for monomerid = 50390572
TargetLysine--tRNA ligase(Homo sapiens (Human))
RhôNe-Poulenc Rorer
Curated by ChEMBL
LigandPNGBDBM50390572(CHEMBL2069361)
Affinity DataIC50:  2.70E+3nM. Assay description: Inhibition of human recombinant full-length Syk using poly-GT as substrate after 40 mins by radioactive filtration assay
In DepthDetails ArticlePubMed