BDBM50390601 CHEMBL2069581
SMILES Cc1cc(ccn1)-c1cccc(NC(=O)[C@H](Cc2ccccc2)NCc2cscn2)c1
InChI Key InChIKey=DIRNQNKSESHJOH-DEOSSOPVSA-N
Data  1 EC50
  Tab Delimited (TSV)   2D SDfile   Computed 3D by Vconf -m prep SDfile
Find this compound or compounds like it in BindingDB:
Activity Spreadsheet -- Enzyme Inhibition Constant Data from BindingDB
Found 1 hit for monomerid = 50390601
TargetProbable G-protein coupled receptor 142(Homo sapiens (Human))
Amgen
Curated by ChEMBL
LigandPNGBDBM50390601(CHEMBL2069581)
Affinity DataEC50:  52nM. Assay description: Agonist activity at human GPR142 expressed in HEK293 cells assessed as inositol phosphate accumulation using [3H]-inositol after 1 hr by scintillatio...
In DepthDetails ArticlePubMed