BDBM50390636 CHEMBL2069615
SMILES CCCCNC(=O)C[C@H](O)[C@H](CC(C)C)NC(=O)[C@@H](NC(=O)c1ccc(Oc2ccc(cc2)C(=O)NCc2ccccc2)cc1)[C@@H](C)CC
InChI Key InChIKey=RHIDJRPHIGMMFH-SDWZQKNDSA-N
Data  1 KI
  Tab Delimited (TSV)   2D SDfile   Computed 3D by Vconf -m prep SDfile
Find this compound or compounds like it in BindingDB:
Activity Spreadsheet -- Enzyme Inhibition Constant Data from BindingDB
Found 1 hit for monomerid = 50390636
TargetPlasmepsin II(Plasmodium falciparum)
Universit£
Curated by ChEMBL
LigandPNGBDBM50390636(CHEMBL2069615)
Affinity DataKi:  1.30nM. Assay description: Inhibition of Plasmodium falciparum PLM2 using Lys-Glu-Phe-Val-Phe-NPhe-Ala-Leu-Lys as substrate by spectrophotometry
In DepthDetails ArticlePubMed