BDBM50390733 CHEMBL2070356
SMILES CC(C)CN(c1ccc(cc1)C(O)(C#Cc1ccccc1)C(F)(F)F)S(=O)(=O)c1ccccc1
InChI Key InChIKey=AMTGRPHGLMMWGU-UHFFFAOYSA-N
Data  2 IC50
  Tab Delimited (TSV)   2D SDfile   Computed 3D by Vconf -m prep SDfile
Find this compound or compounds like it in BindingDB:
Activity Spreadsheet -- Enzyme Inhibition Constant Data from BindingDB
Found 2 hits for monomerid = 50390733
TargetOxysterols receptor LXR-beta(Homo sapiens (Human))
Amgen
Curated by ChEMBL
LigandPNGBDBM50390733(CHEMBL2070356)
Affinity DataIC50:  600nM. Assay description: Displacement of [3H]N-(4-(1,1,1,3,3,3-hexafluoro-2-hydroxypropan-2-yl)phenyl)-N-methylbenzenesulfonamide from GST-tagged LXRbeta ligand binding domai...
In DepthDetails ArticlePubMed
TargetOxysterols receptor LXR-beta(Homo sapiens (Human))
Amgen
Curated by ChEMBL
LigandPNGBDBM50390733(CHEMBL2070356)
Affinity DataIC50:  8.00E+3nM. Assay description: Antagonist activity at LXRbeta ligand binding domain expressed in HEK293 cells coexpressing GAL4 assessed as decrease in [3H]N-(4-(1,1,1,3,3,3-hexafl...
In DepthDetails ArticlePubMed