BDBM50391173 CHEMBL2088233
SMILES [#6]\[#6](-[#6])=[#6]\[#6]-[#6]\[#6](-[#6])=[#6]\[#6]-[#8]-c1cccc2ccc(=O)oc12
InChI Key InChIKey=FEBYMJQGTOFZFS-NTCAYCPXSA-N
Data  1 IC50
  Tab Delimited (TSV)   2D SDfile   Computed 3D by Vconf -m prep SDfile
Find this compound or compounds like it in BindingDB:
Activity Spreadsheet -- Enzyme Inhibition Constant Data from BindingDB
Found 1 hit for monomerid = 50391173
TargetPolyunsaturated fatty acid lipoxygenase ALOX15(Homo sapiens (Human))
Mashhad University Of Medical Sciences
Curated by ChEMBL
LigandPNGBDBM50391173(CHEMBL2088233)
Affinity DataIC50:  3.95E+4nM. Assay description: Inhibition of recombinant human 15-lipoxygenase by MBTH-DMAB method
In DepthDetails ArticlePubMed