BDBM50391175 CHEMBL177085
SMILES [#6]\[#6](-[#6])=[#6]/[#6]-[#6]\[#6](-[#6])=[#6]\[#6]-[#6]\[#6](-[#6])=[#6]\[#6]-[#8]-c1cc(=O)oc2ccccc12
InChI Key InChIKey=LKSOWFDDMCSTFC-NKFKFSAASA-N
Data  1 IC50
  Tab Delimited (TSV)   2D SDfile   Computed 3D by Vconf -m prep SDfile
Find this compound or compounds like it in BindingDB:
Activity Spreadsheet -- Enzyme Inhibition Constant Data from BindingDB
Found 1 hit for monomerid = 50391175
TargetPolyunsaturated fatty acid lipoxygenase ALOX15(Homo sapiens (Human))
Mashhad University Of Medical Sciences
Curated by ChEMBL
LigandPNGBDBM50391175(CHEMBL177085)
Affinity DataIC50:  2.88E+4nM. Assay description: Inhibition of recombinant human 15-lipoxygenase by MBTH-DMAB method
In DepthDetails ArticlePubMed