BDBM50392254 CHEMBL2153492
SMILES OC(=O)CN(CCn1cnc2c1nc[nH]c2=O)CCP(O)(O)=O
InChI Key InChIKey=LDQCHMFOWFMZRP-UHFFFAOYSA-N
Data  1 KI
  Tab Delimited (TSV)   2D SDfile   Computed 3D by Vconf -m prep SDfile
Find this compound or compounds like it in BindingDB:
Activity Spreadsheet -- Enzyme Inhibition Constant Data from BindingDB
Found 1 hit for monomerid = 50392254
TargetHypoxanthine-guanine phosphoribosyltransferase(Homo sapiens (Human))
Academy Of Sciences Of The Czech Republic
Curated by ChEMBL
LigandPNGBDBM50392254(CHEMBL2153492)
Affinity DataKi:  3.20E+4nM. Assay description: Inhibition of human HGPRT using Prib-PP as substrate by spectrophotometric assay in presence of guanine
In DepthDetails ArticlePubMed