BDBM50392784 CHEMBL2151239
SMILES CC(=O)N[C@@H](Cc1ccc(F)c(c1)C(F)(F)F)[C@H](O)CN[C@H]1CC2(CCC2)Oc2ncc(CC(C)(C)C)cc12
InChI Key InChIKey=MYTVXNHBRORZBI-CCDWMCETSA-N
Data  2 IC50
  Tab Delimited (TSV)   2D SDfile   Computed 3D by Vconf -m prep SDfile
Find this compound or compounds like it in BindingDB:
Activity Spreadsheet -- Enzyme Inhibition Constant Data from BindingDB
Found 2 hits for monomerid = 50392784
TargetBeta-secretase 1(Homo sapiens (Human))
TBA
Curated by ChEMBL
LigandPNGBDBM50392784(CHEMBL2151239)
Affinity DataIC50:  11nM. Assay description: Inhibition of BACE
In DepthDetails ArticlePubMed
TargetBeta-secretase 1(Homo sapiens (Human))
TBA
Curated by ChEMBL
LigandPNGBDBM50392784(CHEMBL2151239)
Affinity DataIC50:  18nM. Assay description: Inhibition of BACE by cells based assay
In DepthDetails ArticlePubMed