BDBM50392861 CHEMBL2152070
SMILES COc1ccc(F)c(c1)-c1ccc(COc2cccc(c2)[C@@H](CC(O)=O)C2CC2)cc1C1=CCCC1(C)C
InChI Key InChIKey=CHEANNSDVJOIBS-MHZLTWQESA-N
Data  1 Kd  13 EC50
  Tab Delimited (TSV)   2D SDfile   Computed 3D by Vconf -m prep SDfile
Find this compound or compounds like it in BindingDB:
Activity Spreadsheet -- Enzyme Inhibition Constant Data from BindingDB
Found 14 hits for monomerid = 50392861
TargetFree fatty acid receptor 1(Homo sapiens (Human))
Amgen
Curated by ChEMBL
LigandPNGBDBM50392861(CHEMBL2152070)
Affinity DataEC50:  161nM. Assay description: Agonist activity at GPR40 (unknown origin) expressed in CHO cells assessed as luminescence for 20 seconds interval by aequorin assay in presence of 0...
In DepthDetails ArticlePubMed
TargetFree fatty acid receptor 1(Homo sapiens (Human))
Amgen
Curated by ChEMBL
LigandPNGBDBM50392861(CHEMBL2152070)
Affinity DataEC50:  160nM. Assay description: Agonist activity at human FFA1 receptor expressed in CHO cell membranes after 4 hrs by aequorin bioluminescence assay
In DepthDetails ArticlePubMed
TargetFree fatty acid receptor 1(Homo sapiens (Human))
Amgen
Curated by ChEMBL
LigandPNGBDBM50392861(CHEMBL2152070)
Affinity DataEC50:  160nM. Assay description: Agonist activity at GPR40 expressed in CHO cells after 20 seconds by aequorin bioluminescence assay in presence of 0.1 % human serum
In DepthDetails ArticlePubMed
TargetFree fatty acid receptor 1(Homo sapiens (Human))
Amgen
Curated by ChEMBL
LigandPNGBDBM50392861(CHEMBL2152070)
Affinity DataEC50:  710nM. Assay description: Agonist activity at GPR40 expressed in CHO cells after 20 seconds by aequorin bioluminescence assay in presence of 100 % human serum
In DepthDetails ArticlePubMed
TargetFree fatty acid receptor 1(Homo sapiens (Human))
Amgen
Curated by ChEMBL
LigandPNGBDBM50392861(CHEMBL2152070)
Affinity DataEC50:  130nM. Assay description: Positive allosteric modulation of human GPR40 expressed in HEK293 cells assessed as IP1 accumulation measured after 60 mins by HTRF assay
In DepthDetails ArticlePubMed
TargetFree fatty acid receptor 1(Homo sapiens (Human))
Amgen
Curated by ChEMBL
LigandPNGBDBM50392861(CHEMBL2152070)
Affinity DataEC50:  392nM. Assay description: Positive allosteric modulation of human GPR40 expressed in HEK293 cells assessed as IP1 accumulation measured after 60 mins in presence of 100% human...
In DepthDetails ArticlePubMed
TargetFree fatty acid receptor 1(Homo sapiens (Human))
Amgen
Curated by ChEMBL
LigandPNGBDBM50392861(CHEMBL2152070)
Affinity DataEC50:  160nM. Assay description: Agonist activity at GPR40 (unknown origin) expressed in CHO cells co-expressing luc2P/SRE assessed as firefly luciferase activity incubated for 24 hr...
In DepthDetails ArticlePubMed
TargetFree fatty acid receptor 1(Homo sapiens (Human))
Amgen
Curated by ChEMBL
LigandPNGBDBM50392861(CHEMBL2152070)
Affinity DataEC50:  130nM. Assay description: Positive allosteric modulation of recombinant human GPR40 expressed in HEK293 cells assessed as increase in [3H]-myo-inositol phosphate accumulation ...
In DepthDetails ArticlePubMed
TargetFree fatty acid receptor 1(Homo sapiens (Human))
Amgen
Curated by ChEMBL
LigandPNGBDBM50392861(CHEMBL2152070)
Affinity DataEC50:  392nM. Assay description: Positive allosteric modulation of recombinant human GPR40 expressed in HEK293 cells assessed as increase in [3H]-myo-inositol phosphate accumulation ...
In DepthDetails ArticlePubMed
TargetMelanocortin receptor 4(Rattus norvegicus)
Janssen Research & Developmen
Curated by ChEMBL
LigandPNGBDBM50392861(CHEMBL2152070)
Affinity DataEC50:  11nM. Assay description: Agonist activity at rat GPR40 transfected in HEK293 cells assessed as increase in intracellular calcium level incubated for 1 hr by Fluo-8 dye based ...
In DepthDetails ArticlePubMed
TargetFree fatty acid receptor 1(Homo sapiens (Human))
Amgen
Curated by ChEMBL
LigandPNGBDBM50392861(CHEMBL2152070)
Affinity DataEC50:  3.5nM. Assay description: Agonist activity at human GPR40 transfected in HEK293 cells assessed as increase in intracellular calcium level incubated for 1 hr by Fluo-8 dye base...
In DepthDetails ArticlePubMed
TargetFree fatty acid receptor 1(Homo sapiens (Human))
Amgen
Curated by ChEMBL
LigandPNGBDBM50392861(CHEMBL2152070)
Affinity DataEC50:  150nM. Assay description: Agonist activity at human GPR40 expressed in CHO cells incubated for 60 mins by FLIPR based Ca2+ mobilization assay
In DepthDetails ArticlePubMed
TargetFree fatty acid receptor 1(Homo sapiens (Human))
Amgen
Curated by ChEMBL
LigandPNGBDBM50392861(CHEMBL2152070)
Affinity DataKd:  5nM. Assay description: Binding affinity to human GPR40 expressed in CHO cells by LC-MS analysis
In DepthDetails ArticlePubMed
TargetFree fatty acid receptor 1(Homo sapiens (Human))
Amgen
Curated by ChEMBL
LigandPNGBDBM50392861(CHEMBL2152070)
Affinity DataEC50:  160nM. Assay description: Agonist activity at GPR40 (unknown origin) expressed in CHO cells incubated for 2 hrs measured over 20 secs in presence of human serum albumin by aeq...
In DepthDetails ArticlePubMed