BDBM50393131 CHEMBL2153463
SMILES OC(C(=O)NCc1ccc(cc1)-c1ccc(F)c(c1)C(F)(F)F)(c1ccc(cc1)-c1ccc2cccnc2n1)C(F)(F)F
InChI Key InChIKey=IFYAGVZPYUZBML-UHFFFAOYSA-N
Data  1 IC50
  Tab Delimited (TSV)   2D SDfile   Computed 3D by Vconf -m prep SDfile
Find this compound or compounds like it in BindingDB:
Activity Spreadsheet -- Enzyme Inhibition Constant Data from BindingDB
Found 1 hit for monomerid = 50393131
TargetSuccinate receptor 1(Homo sapiens (Human))
Advinus Therapeutics
Curated by ChEMBL
LigandPNGBDBM50393131(CHEMBL2153463)
Affinity DataIC50:  34nM. Assay description: Antagonist activity at human GPR91 receptor expressed in CHO-K1 cells co-expressing Galpha and Gqi5 G-protein assessed as inhibition of succinate-ind...
In DepthDetails ArticlePubMed