BDBM50393138 CHEMBL2153470
SMILES Fc1ccc(cc1C(F)(F)F)-c1cnc(CNC(=O)CCCc2ccc3cccnc3n2)nc1
InChI Key InChIKey=PDSXXHYTOAMMPD-UHFFFAOYSA-N
Data  1 IC50
  Tab Delimited (TSV)   2D SDfile   Computed 3D by Vconf -m prep SDfile
Find this compound or compounds like it in BindingDB:
Activity Spreadsheet -- Enzyme Inhibition Constant Data from BindingDB
Found 1 hit for monomerid = 50393138
TargetSuccinate receptor 1(Homo sapiens (Human))
Advinus Therapeutics
Curated by ChEMBL
LigandPNGBDBM50393138(CHEMBL2153470)
Affinity DataIC50:  200nM. Assay description: Antagonist activity at human GPR91 receptor expressed in CHO-K1 cells co-expressing Galpha and Gqi5 G-protein assessed as inhibition of succinate-ind...
In DepthDetails ArticlePubMed