BDBM50393450 CHEMBL2159500
SMILES CC(=O)c1cc(c(Sc2c(Cl)cncc2Cl)s1)[N+]([O-])=O
InChI Key InChIKey=JZFGTMFJLSUORF-UHFFFAOYSA-N
Data  2 IC50  1 EC50
  Tab Delimited (TSV)   2D SDfile   Computed 3D by Vconf -m prep SDfile
Find this compound or compounds like it in BindingDB:
Activity Spreadsheet -- Enzyme Inhibition Constant Data from BindingDB
Found 3 hits for monomerid = 50393450
TargetUbiquitin carboxyl-terminal hydrolase 47(Homo sapiens (Human))
TBA
Curated by ChEMBL
LigandPNGBDBM50393450(CHEMBL2159500)
Affinity DataEC50:  1.20E+3nM. Assay description: Inhibition of USP47 by Ub-CHOP reporter assay
In DepthDetails ArticlePubMed
TargetUbiquitin carboxyl-terminal hydrolase 7(Homo sapiens (Human))TBA
LigandPNGBDBM50393450(CHEMBL2159500)
Affinity DataIC50:  2.00E+3nM. Assay description: Inhibition of USP7 (unknown origin)
In DepthDetails PubMed
TargetUbiquitin carboxyl-terminal hydrolase 47(Homo sapiens (Human))
TBA
Curated by ChEMBL
LigandPNGBDBM50393450(CHEMBL2159500)
Affinity DataIC50:  1.20E+3nM. Assay description: Inhibition of USP47 (unknown origin)
In DepthDetails PubMed