BDBM50394398 CHEMBL2160068
SMILES C[C@H]1CN(C[C@@H](C)O1)c1ccc2c(Nc3ccc(Cl)c(c3)-c3nc(c[nH]3)-c3ccccc3)nccc2n1
InChI Key InChIKey=RJYGMRSLXRNCGZ-KDURUIRLSA-N
Data  2 IC50
  Tab Delimited (TSV)   2D SDfile   Computed 3D by Vconf -m prep SDfile
Find this compound or compounds like it in BindingDB:
Activity Spreadsheet -- Enzyme Inhibition Constant Data from BindingDB
Found 2 hits for monomerid = 50394398
TargetSmoothened homolog(Mus musculus)
Genomics Institute Of The Novartis Research Foundation
Curated by ChEMBL
LigandPNGBDBM50394398(CHEMBL2160068)
Affinity DataIC50:  0.200nM. Assay description: Antagonist activity at Smo in mouse TM3 cells expressing Hh12 assessed as inhibition of 1 nM Ag1.5-induced Gli expression incubated for 30 mins prior...
In DepthDetails ArticlePubMed
TargetSmoothened homolog(Mus musculus)
Genomics Institute Of The Novartis Research Foundation
Curated by ChEMBL
LigandPNGBDBM50394398(CHEMBL2160068)
Affinity DataIC50:  6nM. Assay description: Antagonist activity at Smo in mouse TM3 cells expressing Hh12 assessed as inhibition of 25 nM Ag1.5-induced Gli expression incubated for 30 mins prio...
In DepthDetails ArticlePubMed