BDBM50394635 CHEMBL2164590
SMILES FC(F)(F)c1cccc(CN2CCN(CC2)C(=O)Nc2ccccc2)c1
InChI Key InChIKey=LDLJOMMANLWFBU-UHFFFAOYSA-N
Data  2 IC50
  Tab Delimited (TSV)   2D SDfile   Computed 3D by Vconf -m prep SDfile
Find this compound or compounds like it in BindingDB:
Activity Spreadsheet -- Enzyme Inhibition Constant Data from BindingDB
Found 2 hits for monomerid = 50394635
TargetFatty-acid amide hydrolase 1(Homo sapiens (Human))
TBA
Curated by ChEMBL
LigandPNGBDBM50394635(CHEMBL2164590)
Affinity DataIC50:  350nM. Assay description: Inhibition of human FAAH after 1 hr
In DepthDetails ArticlePubMed
TargetFatty-acid amide hydrolase 1 [30-579](Rattus norvegicus (rat))
TBA
Curated by ChEMBL
LigandPNGBDBM50394635(CHEMBL2164590)
Affinity DataIC50:  830nM. Assay description: Inhibition of rat FAAH after 1 hr
In DepthDetails ArticlePubMed