BDBM50394639 CHEMBL2164586
SMILES Fc1cccc(CN2CCN(CC2)C(=O)Nc2ccccc2)c1
InChI Key InChIKey=WRTDIDPMQRGNNT-UHFFFAOYSA-N
Data  2 IC50
  Tab Delimited (TSV)   2D SDfile   Computed 3D by Vconf -m prep SDfile
Find this compound or compounds like it in BindingDB:
Activity Spreadsheet -- Enzyme Inhibition Constant Data from BindingDB
Found 2 hits for monomerid = 50394639
TargetFatty-acid amide hydrolase 1(Homo sapiens (Human))
TBA
Curated by ChEMBL
LigandPNGBDBM50394639(CHEMBL2164586)
Affinity DataIC50:  2.47E+3nM. Assay description: Inhibition of human FAAH after 1 hr
In DepthDetails ArticlePubMed
TargetFatty-acid amide hydrolase 1 [30-579](Rattus norvegicus (rat))
TBA
Curated by ChEMBL
LigandPNGBDBM50394639(CHEMBL2164586)
Affinity DataIC50: >1.00E+4nM. Assay description: Inhibition of rat FAAH after 1 hr
In DepthDetails ArticlePubMed