BDBM50394926 CHEMBL2165676
SMILES CCCN1CCN(CC1)c1cccc(Cl)c1Cl
InChI Key InChIKey=IPVPEZGOUYWZAJ-UHFFFAOYSA-N
Data  2 KI
  Tab Delimited (TSV)   2D SDfile   Computed 3D by Vconf -m prep SDfile
Find this compound or compounds like it in BindingDB:
Activity Spreadsheet -- Enzyme Inhibition Constant Data from BindingDB
Found 2 hits for monomerid = 50394926
TargetD(2) dopamine receptor(Homo sapiens (Human))
National Institute On Drug Abuse-Intramural Research Program
Curated by ChEMBL
LigandPNGBDBM50394926(CHEMBL2165676)
Affinity DataKi:  5.20nM. Assay description: Displacement of [125I]IABN from human D2L receptor expressed in HEK293 cells after 60 mins by gamma counting analysis
In DepthDetails ArticlePubMed
TargetD(3) dopamine receptor(Homo sapiens (Human))
National Institute On Drug Abuse-Intramural Research Program
Curated by ChEMBL
LigandPNGBDBM50394926(CHEMBL2165676)
Affinity DataKi:  6.30nM. Assay description: Displacement of [125I]IABN from human D3 receptor expressed in HEK293 cells after 60 mins by gamma counting analysis
In DepthDetails ArticlePubMed