BDBM50394964 CHEMBL1590659
SMILES Brc1ccc(cc1)S(=O)(=O)c1nnn2c3ccsc3c(NCc3cccs3)nc12
InChI Key InChIKey=DFWASXVSYVOHJH-UHFFFAOYSA-N
Data  1 IC50
  Tab Delimited (TSV)   2D SDfile   Computed 3D by Vconf -m prep SDfile
Find this compound or compounds like it in BindingDB:
Activity Spreadsheet -- Enzyme Inhibition Constant Data from BindingDB
Found 1 hit for monomerid = 50394964
TargetUrea transporter 1(Mus musculus)
San Francisco State University
Curated by ChEMBL
LigandPNGBDBM50394964(CHEMBL1590659)
Affinity DataIC50:  32nM. Assay description: Inhibition of UT-B in wild type CD1 mouse erythrocyte assessed as hemolysis after 10 mins
In DepthDetails ArticlePubMed