BDBM50395090 CHEMBL2164288
SMILES NS(=O)(=O)c1ccc(\[NH+]=N\[CH-]c2cccc(Oc3ccccc3)c2)c(c1)[N+]([O-])=O
InChI Key InChIKey=WCMZDQACDNRVHH-QURGRASLSA-O
Data  1 IC50
  Tab Delimited (TSV)   2D SDfile   Computed 3D by Vconf -m prep SDfile
Find this compound or compounds like it in BindingDB:
Activity Spreadsheet -- Enzyme Inhibition Constant Data from BindingDB
Found 1 hit for monomerid = 50395090
Target5'-nucleotidase(Rattus norvegicus (Rat))
Rheinische Friedrich-Wilhelms-Universit£T
Curated by ChEMBL
LigandPNGBDBM50395090(CHEMBL2164288)
Affinity DataIC50:  3.99E+3nM. Assay description: Inhibition of rat recombinant ecto-5'-nucleotidase using [3H]AMP substrate
In DepthDetails ArticlePubMed