BDBM50395599 CHEMBL2165305
SMILES CC(C)CC(NC(=O)OCc1ccccc1)C(=O)NC(CCC(N)=O)P(=O)(Oc1ccccc1)Oc1ccccc1
InChI Key InChIKey=PPTRDKZZZSBEFU-UHFFFAOYSA-N
Data  1 KI
  Tab Delimited (TSV)   2D SDfile   Computed 3D by Vconf -m prep SDfile
Find this compound or compounds like it in BindingDB:
Activity Spreadsheet -- Enzyme Inhibition Constant Data from BindingDB
Found 1 hit for monomerid = 50395599
TargetSerine protease SplB(Staphylococcus aureus)
Wroclaw University Of Technology
Curated by ChEMBL
LigandPNGBDBM50395599(CHEMBL2165305)
Affinity DataKi: >2.00E+5nM. Assay description: Inhibition of Staphylococcus aureus SplB using fluorogenic Ac-Tro-Glu-Leu-Gln-ACC as substrate by spectrofluorometry
In DepthDetails ArticlePubMed