BDBM50395601 CHEMBL2165303
SMILES CC(C)(C)c1ccc(OP(=O)(Oc2ccc(cc2)C(C)(C)C)C(CCC(N)=O)NC(=O)OCc2ccccc2)cc1
InChI Key InChIKey=OBQAZIJXGXIULH-UHFFFAOYSA-N
Data  1 KI
  Tab Delimited (TSV)   2D SDfile   Computed 3D by Vconf -m prep SDfile
Find this compound or compounds like it in BindingDB:
Activity Spreadsheet -- Enzyme Inhibition Constant Data from BindingDB
Found 1 hit for monomerid = 50395601
TargetSerine protease SplB(Staphylococcus aureus)
Wroclaw University Of Technology
Curated by ChEMBL
LigandPNGBDBM50395601(CHEMBL2165303)
Affinity DataKi: >2.00E+5nM. Assay description: Inhibition of Staphylococcus aureus SplB using fluorogenic Ac-Tro-Glu-Leu-Gln-ACC as substrate by spectrofluorometry
In DepthDetails ArticlePubMed