BDBM50396948 CHEMBL2170812
SMILES Fc1ccc(Cn2nnc3ncc(nc23)-c2ccc(F)cc2)cc1
InChI Key InChIKey=AXUUDVBUGHICDU-UHFFFAOYSA-N
Data  1 KI  1 IC50
  Tab Delimited (TSV)   2D SDfile   Computed 3D by Vconf -m prep SDfile
Find this compound or compounds like it in BindingDB:
Activity Spreadsheet -- Enzyme Inhibition Constant Data from BindingDB
Found 2 hits for monomerid = 50396948
TargetHepatocyte growth factor receptor(Homo sapiens (Human))
Pfizer
Curated by ChEMBL
LigandPNGBDBM50396948(CHEMBL2170812)
Affinity DataKi:  653nM. Assay description: Competitive inhibition of N-terminal His6-tagged recombinant human c-MET (974 to 1390 amino acids) by spectrophotometry
In DepthDetails ArticlePubMed
TargetHepatocyte growth factor receptor(Homo sapiens (Human))
Pfizer
Curated by ChEMBL
LigandPNGBDBM50396948(CHEMBL2170812)
Affinity DataIC50:  1.00E+4nM. Assay description: Antagonist activity at c-MET receptor in human A549 cells assessed as inhibition of autophosphorylation after 1 hr by ELISA
In DepthDetails ArticlePubMed