BDBM50396968 CHEMBL2170805
SMILES CN(C)CCNc1cnc2nnn(Cc3ccc4ncccc4c3)c2n1
InChI Key InChIKey=FRGBZZPUEOIMQH-UHFFFAOYSA-N
Data  1 KI  1 IC50
  Tab Delimited (TSV)   2D SDfile   Computed 3D by Vconf -m prep SDfile
Find this compound or compounds like it in BindingDB:
Activity Spreadsheet -- Enzyme Inhibition Constant Data from BindingDB
Found 2 hits for monomerid = 50396968
TargetHepatocyte growth factor receptor(Homo sapiens (Human))
Pfizer
Curated by ChEMBL
LigandPNGBDBM50396968(CHEMBL2170805)
Affinity DataKi:  140nM. Assay description: Competitive inhibition of N-terminal His6-tagged recombinant human c-MET (974 to 1390 amino acids) by spectrophotometry
In DepthDetails ArticlePubMed
TargetHepatocyte growth factor receptor(Homo sapiens (Human))
Pfizer
Curated by ChEMBL
LigandPNGBDBM50396968(CHEMBL2170805)
Affinity DataIC50:  165nM. Assay description: Antagonist activity at c-MET receptor in human A549 cells assessed as inhibition of autophosphorylation after 1 hr by ELISA
In DepthDetails ArticlePubMed