BDBM50398024 CHEMBL2181095
SMILES O=Cc1ccc(cc1)N1CCN(CC1)S(=O)(=O)c1ccc2NC(=O)Cc2c1
InChI Key InChIKey=SSVMEIZADFTJPV-UHFFFAOYSA-N
Data  2 IC50
  Tab Delimited (TSV)   2D SDfile   Computed 3D by Vconf -m prep SDfile
Find this compound or compounds like it in BindingDB:
Activity Spreadsheet -- Enzyme Inhibition Constant Data from BindingDB
Found 2 hits for monomerid = 50398024
TargetLysosomal alpha-glucosidase(Homo sapiens (Human))
National Center For Advancing Translational Sciences
Curated by ChEMBL
LigandPNGBDBM50398024(CHEMBL2181095)
Affinity DataIC50:  4.11E+3nM. Assay description: Inhibition of wild type recombinant GAA preincubated for 5 mins measured after 45 mins using red-shifted dye by fluorescence assay
In DepthDetails ArticlePubMed
TargetLysosomal alpha-glucosidase(Homo sapiens (Human))
National Center For Advancing Translational Sciences
Curated by ChEMBL
LigandPNGBDBM50398024(CHEMBL2181095)
Affinity DataIC50:  3.66E+3nM. Assay description: Inhibition of wild type recombinant GAA preincubated for 5 mins measured after 45 mins using blue-shifted dye by fluorescence assay
In DepthDetails ArticlePubMed