BDBM50398808 CHEMBL2177506
SMILES OC(=O)[C@H](F)C[C@@H](CP(O)(O)=O)C(O)=O
InChI Key InChIKey=SJIJEWUUIKDXIM-IUYQGCFVSA-N
Data  2 KI  2 IC50
  Tab Delimited (TSV)   2D SDfile   Computed 3D by Vconf -m prep SDfile
Find this compound or compounds like it in BindingDB:
Activity Spreadsheet -- Enzyme Inhibition Constant Data from BindingDB
Found 4 hits for monomerid = 50398808
TargetGlutamate carboxypeptidase 2(Homo sapiens (Human))
Bayer Healthcare
Curated by ChEMBL
LigandPNGBDBM50398808(CHEMBL2177506)
Affinity DataKi:  2.60nM. Assay description: Inhibition of NAALADase activity in human LNCaP cell membranes assessed as inhibition of [3H]NAG conversion to [3H]glutamate after 30 mins by liquid ...
In DepthDetails ArticlePubMed
TargetGlutamate carboxypeptidase 2(Homo sapiens (Human))
Bayer Healthcare
Curated by ChEMBL
LigandPNGBDBM50398808(CHEMBL2177506)
Affinity DataKi:  36.4nM. Assay description: Inhibition of NAALADase activity in human LNCaP cell membranes assessed as inhibition of [3H]NAG conversion to [3H]glutamate after 30 mins by liquid ...
In DepthDetails ArticlePubMed
TargetGlutamate carboxypeptidase 2(Homo sapiens (Human))
Bayer Healthcare
Curated by ChEMBL
LigandPNGBDBM50398808(CHEMBL2177506)
Affinity DataIC50:  6.80nM. Assay description: Inhibition of NAALADase activity in human LNCaP cell membranes assessed as inhibition of [3H]NAG conversion to [3H]glutamate after 30 mins by liquid ...
In DepthDetails ArticlePubMed
TargetGlutamate carboxypeptidase 2(Homo sapiens (Human))
Bayer Healthcare
Curated by ChEMBL
LigandPNGBDBM50398808(CHEMBL2177506)
Affinity DataIC50:  89.4nM. Assay description: Inhibition of NAALADase activity in human LNCaP cell membranes assessed as inhibition of [3H]NAG conversion to [3H]glutamate after 30 mins by liquid ...
In DepthDetails ArticlePubMed