BDBM50398967 CHEMBL2179672
SMILES Cn1cc2c(OCC3CCN(CCc4ccc(CO)cc4)CC3)nc3ccccc3c2c1
InChI Key InChIKey=KVVCXQIQAOOKFF-UHFFFAOYSA-N
Data  2 KI  1 IC50
  Tab Delimited (TSV)   2D SDfile   Computed 3D by Vconf -m prep SDfile
Find this compound or compounds like it in BindingDB:
Activity Spreadsheet -- Enzyme Inhibition Constant Data from BindingDB
Found 3 hits for monomerid = 50398967
Target5-hydroxytryptamine receptor 4(Homo sapiens (Human))
Angelini Santa Palomba Research Center
Curated by ChEMBL
LigandPNGBDBM50398967(CHEMBL2179672)
Affinity DataKi:  10nM. Assay description: Displacement of [3H](1-(2-(methylsulfonamido)ethyl)piperidin-4-yl)methyl 1-methyl-1H-indole-3-carboxylate from human 5HT4R expressed in HEK293 cells
In DepthDetails ArticlePubMed
Target5-hydroxytryptamine receptor 2A(Homo sapiens (Human))
Angelini Santa Palomba Research Center
Curated by ChEMBL
LigandPNGBDBM50398967(CHEMBL2179672)
Affinity DataKi:  31.6nM. Assay description: Displacement of [3H]ketanserin from human 5HT2AR expressed in CHOK1 cells
In DepthDetails ArticlePubMed
TargetPotassium voltage-gated channel subfamily H member 2(Homo sapiens (Human))
Angelini Santa Palomba Research Center
Curated by ChEMBL
LigandPNGBDBM50398967(CHEMBL2179672)
Affinity DataIC50:  10nM. Assay description: Inhibition of human ERG
In DepthDetails ArticlePubMed