BDBM50399206 CHEMBL2180180
SMILES C(N1c2ccccc2Oc2ccccc12)c1ccccc1
InChI Key InChIKey=GQVHHJFINFPLNI-UHFFFAOYSA-N
Data  1 IC50
  Tab Delimited (TSV)   2D SDfile   Computed 3D by Vconf -m prep SDfile
Find this compound or compounds like it in BindingDB:
Activity Spreadsheet -- Enzyme Inhibition Constant Data from BindingDB
Found 1 hit for monomerid = 50399206
TargetP2X purinoceptor 4(Homo sapiens (Human))
University Of Bonn
Curated by ChEMBL
LigandPNGBDBM50399206(CHEMBL2180180)
Affinity DataIC50: >1.00E+4nM. Assay description: Antagonist activity at human P2X4 receptor expressed in 1321N1 cells assessed as inhibition of ATP-induced cytosolic calcium influx compound preincub...
In DepthDetails ArticlePubMed